[AMBER-Developers] Parallel make failing

From: Daniel Roe <daniel.r.roe.gmail.com>
Date: Thu, 26 May 2016 08:40:12 -0600

Using the current GIT tree, 'make -jX' is failing around pbsa again:

mpif90 -DBINTRAJ -DMPI -c -O3 -mtune=native -fPIC -ffree-form
-I/home/droe/Amber/GIT/amber/include -o pb_force.o pb_force.F90

                                      sa_init, sa_driver, sa_free,
sa_free_mb, &
Error: Symbol ‘saslave_init’ referenced at (1) not found in module
Makefile:226: recipe for target 'pb_force.o' failed
make[3]: *** [pb_force.o] Error 1
make[3]: *** Waiting for unfinished jobs....
make[3]: Leaving directory '/home/droe/Amber/GIT/amber/AmberTools/src/pbsa'
Makefile:479: recipe for target 'libpbsa' failed
make[2]: *** [libpbsa] Error 2
make[2]: Leaving directory '/home/droe/Amber/GIT/amber/AmberTools/src/sander'
Makefile:232: recipe for target 'parallel' failed
make[1]: *** [parallel] Error 2
make[1]: Leaving directory '/home/droe/Amber/GIT/amber/AmberTools/src'
Makefile:7: recipe for target 'install' failed
make: *** [install] Error 2

Single-threaded 'make' succeeds but takes a long, long time. Anyone
else seeing this?


Daniel R. Roe, PhD
Department of Medicinal Chemistry
University of Utah
30 South 2000 East, Room 307
Salt Lake City, UT 84112-5820
(801) 587-9652
(801) 585-6208 (Fax)
AMBER-Developers mailing list
Received on Thu May 26 2016 - 08:00:02 PDT
Custom Search