[AMBER-Developers] parallel compile error

From: InSuk Joung <i.joung.gmail.com>
Date: Fri, 26 Mar 2010 13:40:59 -0400

make[2]: Entering directory `/home/isjoung/AMBER/amber11/src/semantics'
./parse *.rules
./parse: error while loading shared libraries: libmpi.so.0: cannot open
shared object file: No such file or directory
make[2]: *** [checkexpr.c] error 127
make[2]: Leaving directory `/home/isjoung/AMBER/amber11/src/semantics'
make[1]: *** [checkexpr.c] error 2
make[1]: Leaving directory `/home/isjoung/AMBER/amber11/src/nab'
make: *** [parallel] error 2

There is 'libmpi.so.0' in $AMBERHOME/lib. But 'parse' doesn't seem to
search through the directory.
After I put it in $LD_LIBRARY_PATH, 'parse' stopped complaining about this.

InSuk Joung
AMBER-Developers mailing list
Received on Fri Mar 26 2010 - 11:00:02 PDT
Custom Search